Target
Glucose-dependent insulinotropic receptor
Ligand
BDBM50447724
Substrate
Meas. Tech.
ChEMBL_1289704 (CHEMBL3118588)
EC50
100±n/a nM
Citation
 Wang, YYu, MZhu, JZhang, JKKayser, FMedina, JCSiegler, KConn, MShan, BGrillo, MPLiu, JJCoward, P Discovery and optimization of 5-(2-((1-(phenylsulfonyl)-1,2,3,4-tetrahydroquinolin-7-yl)oxy)pyridin-4-yl)-1,2,4-oxadiazoles as novel gpr119 agonists. Bioorg Med Chem Lett 24:1133-7 (2014)  
Target
Name:
Glucose-dependent insulinotropic receptor
Synonyms:
G-protein coupled receptor 119 (GPR119) GPR119 | Glucose-dependent insulinotropic receptor
Type:
Protein
Mol. Mass.:
36901.49
Organism:
Homo sapiens (Human)
Description:
Q8TDV5
Residue:
335
  
Inhibitor
Name:
BDBM50447724
Synonyms:
CHEMBL3112995
Type:
Small organic molecule
Emp. Form.:
C24H17Cl3N4O4S2
Mol. Mass.:
595.905
SMILES:
Clc1ccc(cc1)S(=O)(=O)N1CCSc2cc(Cl)c(Oc3cc(cc(Cl)n3)-c3nc(no3)C3CC3)cc12
: