Target
Cytochrome P450 2C9
Ligand
BDBM50448108
Substrate
Meas. Tech.
ChEMBL_1293805 (CHEMBL3123417)
IC50
>10000±n/a nM
Citation
 Zhang, NZhang, XZhu, JTurpoff, AChen, GMorrill, CHuang, SLennox, WKakarla, RLiu, RLi, CRen, HAlmstead, NVenkatraman, SNjoroge, FGGu, ZClausen, VGraci, JJung, SPZheng, YColacino, JMLahser, FSheedy, JMollin, AWeetall, MNomeir, AKarp, GM Structure-activity relationship (SAR) optimization of 6-(indol-2-yl)pyridine-3-sulfonamides: identification of potent, selective, and orally bioavailable small molecules targeting hepatitis C (HCV) NS4B. J Med Chem 57:2121-35 (2014)  
Target
Name:
Cytochrome P450 2C9
Synonyms:
(R)-limonene 6-monooxygenase CP2C9_HUMAN CYP2C9 Cytochrome P450 2C9 (CYP2C9 ) P-450MP P450 PB-1 | S-mephenytoin 4-hydroxylase
Type:
Enzyme
Mol. Mass.:
55636.33
Organism:
Homo sapiens (Human)
Description:
P11712
Residue:
490
  
Inhibitor
Name:
BDBM50448108
Synonyms:
CHEMBL3121694
Type:
Small organic molecule
Emp. Form.:
C22H15F5N6O2S
Mol. Mass.:
522.451
SMILES:
C[C@H](NS(=O)(=O)c1ccc(nc1)-c1c(C#N)c2cc(F)c(C)cc2n1-c1ncc(F)cn1)C(F)(F)F
: