Target
Cytochrome P450 2D6
Ligand
BDBM50448104
Substrate
Meas. Tech.
ChEMBL_1293806 (CHEMBL3123418)
IC50
>10000±n/a nM
Citation
 Zhang, NZhang, XZhu, JTurpoff, AChen, GMorrill, CHuang, SLennox, WKakarla, RLiu, RLi, CRen, HAlmstead, NVenkatraman, SNjoroge, FGGu, ZClausen, VGraci, JJung, SPZheng, YColacino, JMLahser, FSheedy, JMollin, AWeetall, MNomeir, AKarp, GM Structure-activity relationship (SAR) optimization of 6-(indol-2-yl)pyridine-3-sulfonamides: identification of potent, selective, and orally bioavailable small molecules targeting hepatitis C (HCV) NS4B. J Med Chem 57:2121-35 (2014)  
Target
Name:
Cytochrome P450 2D6
Synonyms:
CP2D6_HUMAN CYP2DL1 Cytochrome P450 2D6 (CYP2D6) P450-DB1
Type:
Protein
Mol. Mass.:
55774.82
Organism:
Homo sapiens (Human)
Description:
P10635
Residue:
497
  
Inhibitor
Name:
BDBM50448104
Synonyms:
CHEMBL3121804
Type:
Small organic molecule
Emp. Form.:
C23H17F5N6O2S
Mol. Mass.:
536.477
SMILES:
CCc1cc2n(c(c(C#N)c2cc1F)-c1ccc(cn1)S(=O)(=O)N[C@@H](C)C(F)(F)F)-c1ncc(F)cn1
: