Target
5-hydroxytryptamine receptor 4
Ligand
BDBM82505
Substrate
Meas. Tech.
ChEMBL_1297283 (CHEMBL3132069)
Kd
0.020000±n/a nM
Citation
 Caillé, FMorley, TJTavares, AAPapin, CTwardy, NMAlagille, DLee, HSBaldwin, RMSeibyl, JPBarret, OTamagnan, GD Synthesis and biological evaluation of positron emission tomography radiotracers targeting serotonin 4 receptors in brain: [18F]MNI-698 and [18F]MNI-699. Bioorg Med Chem Lett 23:6243-7 (2013)  
Target
Name:
5-hydroxytryptamine receptor 4
Synonyms:
5-HT4 5HT4R_CAVPO Serotonin 4 (5-HT4) receptor
Type:
Enzyme Catalytic Domain
Mol. Mass.:
43735.29
Organism:
GUINEA PIG
Description:
5-HT4 HTR4 GUINEA PIG::O70528
Residue:
388
  
Inhibitor
Name:
BDBM82505
Synonyms:
CAS_121881 SB204070
Type:
Small organic molecule
Emp. Form.:
C19H27ClN2O4
Mol. Mass.:
382.882
SMILES:
CCCCN1CCC(COC(=O)c2cc(Cl)c(N)c3OCCOc23)CC1
: