Target
Peroxisome proliferator-activated receptor gamma
Ligand
BDBM28681
Substrate
Meas. Tech.
ChEMBL_154529 (CHEMBL760250)
Ki
47±n/a nM
Citation
 Henke, BRBlanchard, SGBrackeen, MFBrown, KKCobb, JECollins, JLHarrington, WWHashim, MAHull-Ryde, EAKaldor, IKliewer, SALake, DHLeesnitzer, LMLehmann, JMLenhard, JMOrband-Miller, LAMiller, JFMook, RANoble, SAOliver, WParks, DJPlunket, KDSzewczyk, JRWillson, TM N-(2-Benzoylphenyl)-L-tyrosine PPARgamma agonists. 1. Discovery of a novel series of potent antihyperglycemic and antihyperlipidemic agents. J Med Chem 41:5020-36 (1999)  
Target
Name:
Peroxisome proliferator-activated receptor gamma
Synonyms:
NR1C3 PPAR-gamma PPARG_HUMAN Peroxisome proliferator-activated receptor gamma (PPAR gamma) Peroxisome proliferator-activated receptor gamma (PPARĪ³) peroxisome proliferator-activated receptor gamma isoform 2
Type:
Nuclear Receptor
Mol. Mass.:
57613.46
Organism:
Homo sapiens (Human)
Description:
P37231
Residue:
505
  
Inhibitor
Name:
BDBM28681
Synonyms:
5-[(4-{2-[methyl(pyridin-2-yl)amino]ethoxy}phenyl)methyl]-1,3-thiazolidine-2,4-dione BRL 49653 CHEMBL121 [3H]rosiglitazone rosiglitazone
Type:
radiolabeled ligand
Emp. Form.:
C18H19N3O3S
Mol. Mass.:
357.427
SMILES:
CN(CCOc1ccc(Cc2sc(=O)[nH]c2O)cc1)c1ccccn1
: