Target
5-hydroxytryptamine receptor 6
Ligand
BDBM50001832
Substrate
Meas. Tech.
ChEMBL_304014 (CHEMBL840097)
Ki
0.13±n/a nM
Citation
 López-Rodríguez, MLBenhamú, Bde la Fuente, TSanz, APardo, LCampillo, M A three-dimensional pharmacophore model for 5-hydroxytryptamine6 (5-HT6) receptor antagonists. J Med Chem 48:4216-9 (2005)  
Target
Name:
5-hydroxytryptamine receptor 6
Synonyms:
5-HT-6 5-hydroxytryptamine receptor 6 (5-HT-6) 5-hydroxytryptamine receptor 6 (5HT6) HTR6 Serotonin 6 (5-HT6) receptor | Serotonin Receptor 6
Type:
G Protein-Coupled Receptor (GPCR)
Mol. Mass.:
46968.43
Organism:
Homo sapiens (Human)
Description:
P50406
Residue:
440
  
Inhibitor
Name:
BDBM50001832
Synonyms:
CHEMBL365569
Type:
Small organic molecule
Emp. Form.:
C18H19N3O2S
Mol. Mass.:
341.427
SMILES:
O=S(=O)(c1cc2c(cccc2[nH]1)N1CCNCC1)c1ccccc1
: