Target
Serine/threonine-protein kinase pim-1
Ligand
BDBM2683
Substrate
Meas. Tech.
ChEMBL_326168 (CHEMBL864489)
Kd
10.0±n/a nM
Citation
 Bullock, ANDebreczeni, JEFedorov, OYNelson, AMarsden, BDKnapp, S Structural basis of inhibitor specificity of the human protooncogene proviral insertion site in moloney murine leukemia virus (PIM-1) kinase. J Med Chem 48:7604-14 (2005)  
Target
Name:
Serine/threonine-protein kinase pim-1
Synonyms:
PIM-1 Kinase PIM1_HUMAN Serine/threonine-protein kinase (PIM1) Serine/threonine-protein kinase PIM1 | Serine/threonine-protein kinase pim-1 (PIM1)
Type:
Protein
Mol. Mass.:
35681.82
Organism:
Homo sapiens (Human)
Description:
P11309
Residue:
313
  
Inhibitor
Name:
BDBM2683
Synonyms:
2-[1-(3-dimethylaminopropyl)-indol-3-yl]-3-(indol-3-yl)maleimide BIM-1 GF 109203X | JMC526193 Compound 2
Type:
Small organic molecule
Emp. Form.:
C25H24N4O2
Mol. Mass.:
412.4837
SMILES:
CN(C)CCCn1cc(C2=C(C(=O)NC2=O)c2c[nH]c3ccccc23)c2ccccc12
: