Target
Beta-1 adrenergic receptor
Ligand
BDBM50002610
Substrate
Meas. Tech.
ChEMBL_352669 (CHEMBL862149)
EC50
1259±n/a nM
Citation
 Uehling, DEShearer, BGDonaldson, KHChao, EYDeaton, DNAdkison, KKBrown, KKCariello, NFFaison, WLLancaster, MELin, JHart, RMilliken, TOPaulik, MASherman, BWSugg, EECowan, C Biarylaniline phenethanolamines as potent and selective beta3 adrenergic receptor agonists. J Med Chem 49:2758-71 (2006)  
Target
Name:
Beta-1 adrenergic receptor
Synonyms:
ADRB1 ADRB1_HUMAN Beta-1 adrenoceptor | adrenergic Beta1
Type:
G Protein-Coupled Receptor (GPCR)
Mol. Mass.:
51338.40
Organism:
Homo sapiens (Human)
Description:
P08588
Residue:
477
  
Inhibitor
Name:
BDBM50002610
Synonyms:
CHEMBL208352
Type:
Small organic molecule
Emp. Form.:
C24H25ClN2O3
Mol. Mass.:
424.92
SMILES:
COC(=O)c1cccc(c1)-c1cccc(NCCNC[C@H](O)c2cccc(Cl)c2)c1
: