Target
Acetylcholinesterase
Ligand
BDBM50336116
Substrate
Meas. Tech.
ChEMBL_1278101 (CHEMBL3095599)
Ki
5.0±n/a nM
Citation
 Komloova, MHorova, AHrabinova, MJun, DDolezal, MVinsova, JKuca, KMusilek, K Preparation, in vitro evaluation and molecular modelling of pyridinium-quinolinium/isoquinolinium non-symmetrical bisquaternary cholinesterase inhibitors. Bioorg Med Chem Lett 23:6663-6 (2013)  
Target
Name:
Acetylcholinesterase
Synonyms:
ACES_HUMAN Acetylcholinesterase (AChE) | Acetylcholinesterase (human AChE)
Type:
Enzyme
Mol. Mass.:
67792.70
Organism:
Homo sapiens (Human)
Description:
P22303
Residue:
614
  
Inhibitor
Name:
BDBM50336116
Synonyms:
Ambenonium dichloride | CHEMBL1669479
Type:
Small organic molecule
Emp. Form.:
C24H34Cl2N4O2
Mol. Mass.:
481.457
SMILES:
C[N+](C)(CCNC(=O)C(=O)NCC[N+](C)(C)Cc1ccccc1Cl)Cc1ccccc1Cl
: