Target
Orexin/Hypocretin receptor type 1
Ligand
BDBM50000984
Substrate
Meas. Tech.
ChEMBL_1337235 (CHEMBL3240643)
IC50
6.3±n/a nM
Citation
 Kuduk, SDSkudlarek, JWDi Marco, CNBruno, JGPausch, MAO'Brien, JACabalu, TDStevens, JBrunner, JTannenbaum, PLGotter, ALWinrow, CJRenger, JJColeman, PJ Synthesis and evaluation of carbon-linked analogs of dual orexin receptor antagonist filorexant. Bioorg Med Chem Lett 24:1784-9 (2014)  
Target
Name:
Orexin/Hypocretin receptor type 1
Synonyms:
HCRTR1 OX1R_HUMAN Orexin receptor type 1 (OR 1) Orexin receptor type 1 (OX1) Orexin receptor type 1 (OxR1) | Ox1r
Type:
Protein
Mol. Mass.:
47554.50
Organism:
Homo sapiens (Human)
Description:
O43613
Residue:
425
  
Inhibitor
Name:
BDBM50000984
Synonyms:
CHEMBL3235265
Type:
Small organic molecule
Emp. Form.:
C25H26N4O2
Mol. Mass.:
414.4995
SMILES:
C[C@@H]1CC[C@H](CN1C(=O)c1cc(C)ccc1-n1nccn1)C#Cc1cccc(CO)c1
: