Target
Diamine acetyltransferase 1
Ligand
BDBM50000999
Substrate
Meas. Tech.
ChEMBL_1337637 (CHEMBL3242686)
Ki
2400±n/a nM
Citation
 Huang, TLMayence, AVanden Eynde, JJ Some non-conventional biomolecular targets for diamidines. A short survey. Bioorg Med Chem 22:1983-92 (2014)  
Target
Name:
Diamine acetyltransferase 1
Synonyms:
SAT SAT1_HUMAN | Spermidine/spermine N(1)-acetyltransferase 1
Type:
PROTEIN
Mol. Mass.:
20017.22
Organism:
Homo sapiens (Human)
Description:
ChEMBL_1337637
Residue:
171
  
Inhibitor
Name:
BDBM50000999
Synonyms:
CHEBI:81724 | DIMINAZENE
Type:
Small organic molecule
Emp. Form.:
C14H15N7
Mol. Mass.:
281.3158
SMILES:
NC(=N)c1ccc(N\N=N\c2ccc(cc2)C(N)=N)cc1
: