Target
Prostaglandin G/H synthase 1
Ligand
BDBM50001746
Substrate
Meas. Tech.
ChEMBL_1337743 (CHEMBL3240192)
IC50
>500000±n/a nM
Citation
 Yamakawa, NSuzuki, KYamashita, YKatsu, THanaya, KShoji, MSugai, TMizushima, T Structure-activity relationship of celecoxib and rofecoxib for the membrane permeabilizing activity. Bioorg Med Chem 22:2529-34 (2014)  
Target
Name:
Prostaglandin G/H synthase 1
Synonyms:
COX1 Cyclooxygenase-1 (COX-1) PTGS1 | Prostaglandin G/H synthase (cyclooxygenase)
Type:
Protein
Mol. Mass.:
68868.60
Organism:
Ovis aries (Sheep)
Description:
Residue:
600
  
Inhibitor
Name:
BDBM50001746
Synonyms:
CHEMBL3238414
Type:
Small organic molecule
Emp. Form.:
C17H13F3N2O2S
Mol. Mass.:
366.358
SMILES:
CS(=O)(=O)c1ccc(cc1)-n1nc(cc1-c1ccccc1)C(F)(F)F
: