Target
Mineralocorticoid receptor
Ligand
BDBM50326933
Substrate
Meas. Tech.
ChEMBL_1338548 (CHEMBL3241425)
IC50
580±n/a nM
Citation
 Razavi, HRiether, DHarcken, CBentzien, JDinallo, RMSouza, DNelson, RMKukulka, AFadra-Khan, TNPack, EJZuvela-Jelaska, LPelletier, JPanzenbeck, MTorcellini, CAProudfoot, JRNabozny, GHThomson, DS Discovery of a potent and dissociated non-steroidal glucocorticoid receptor agonist containing an alkyl carbinol pharmacophore. Bioorg Med Chem Lett 24:1934-40 (2014)  
Target
Name:
Mineralocorticoid receptor
Synonyms:
MCR MLR NR3C2 | Nuclear receptor subfamily 3 group C member 2
Type:
Enzyme
Mol. Mass.:
107076.42
Organism:
Homo sapiens (Human)
Description:
P08235
Residue:
984
  
Inhibitor
Name:
BDBM50326933
Synonyms:
1,1,1-Trifluoro-4-(5-fluoro-2-methoxyphenyl)-4-methyl-2-(1H-pyrrolo[2,3-c]pyridin-2-ylmethyl)pentan-2-ol | CHEMBL1254734
Type:
Small organic molecule
Emp. Form.:
C21H22F4N2O2
Mol. Mass.:
410.4052
SMILES:
COc1ccc(F)cc1C(C)(C)CC(O)(Cc1cc2ccncc2[nH]1)C(F)(F)F
: