Target
Mineralocorticoid receptor
Ligand
BDBM50001768
Substrate
Meas. Tech.
ChEMBL_1338548 (CHEMBL3241425)
IC50
420±n/a nM
Citation
 Razavi, HRiether, DHarcken, CBentzien, JDinallo, RMSouza, DNelson, RMKukulka, AFadra-Khan, TNPack, EJZuvela-Jelaska, LPelletier, JPanzenbeck, MTorcellini, CAProudfoot, JRNabozny, GHThomson, DS Discovery of a potent and dissociated non-steroidal glucocorticoid receptor agonist containing an alkyl carbinol pharmacophore. Bioorg Med Chem Lett 24:1934-40 (2014)  
Target
Name:
Mineralocorticoid receptor
Synonyms:
MCR MLR NR3C2 | Nuclear receptor subfamily 3 group C member 2
Type:
Enzyme
Mol. Mass.:
107076.42
Organism:
Homo sapiens (Human)
Description:
P08235
Residue:
984
  
Inhibitor
Name:
BDBM50001768
Synonyms:
CHEMBL3233281
Type:
Small organic molecule
Emp. Form.:
C24H31FN2O
Mol. Mass.:
382.5141
SMILES:
Cc1ccc(F)cc1C(C)(C)C[C@@](O)(Cc1cc2cnccc2[nH]1)C(C)(C)C
: