Target
5-hydroxytryptamine receptor 7
Ligand
BDBM21367
Substrate
Meas. Tech.
ChEMBL_1337342 (CHEMBL3241204)
Ki
0.220000±n/a nM
Citation
 Canale, VGuzik, PKurczab, RVerdie, PSatala, GKubica, BPawlowski, MMartinez, JSubra, GBojarski, AJZajdel, P Solid-supported synthesis, molecular modeling, and biological activity of long-chain arylpiperazine derivatives with cyclic amino acid amide fragments as 5-HT(7) and 5-HT(1A) receptor ligands. Eur J Med Chem 78:10-22 (2014)  
Target
Name:
5-hydroxytryptamine receptor 7
Synonyms:
5-HT-7 5-HT7 5-HT7S 5HT7 HTR7 | Serotonin receptor 7
Type:
G Protein-Coupled Receptor (GPCR)
Mol. Mass.:
53573.08
Organism:
Homo sapiens (Human)
Description:
P34969
Residue:
479
  
Inhibitor
Name:
BDBM21367
Synonyms:
6-{4-[2-(methylsulfanyl)phenyl]piperazin-1-yl}-N-(1,2,3,4-tetrahydronaphthalen-1-yl)hexanamide LP-44 | Piperazinehexanamide derivative, 5
Type:
Small organic molecule
Emp. Form.:
C27H37N3OS
Mol. Mass.:
451.667
SMILES:
CSc1ccccc1N1CCN(CCCCCC(=O)NC2CCCc3ccccc23)CC1
: