Target
Acetylcholinesterase
Ligand
BDBM50003963
Substrate
Meas. Tech.
ChEMBL_1337354 (CHEMBL3241348)
IC50
12910±n/a nM
Citation
 Saeed, AMahesar, PAZaib, SKhan, MSMatin, AShahid, MIqbal, J Synthesis, cytotoxicity and molecular modelling studies of new phenylcinnamide derivatives as potent inhibitors of cholinesterases. Eur J Med Chem 78:43-53 (2014)  
Target
Name:
Acetylcholinesterase
Synonyms:
ACES_ELEEL Acetylcholinesterase (EeAChE) | ache
Type:
Enzyme
Mol. Mass.:
71812.79
Organism:
Electrophorus electricus (Electric eel)
Description:
Residue:
633
  
Inhibitor
Name:
BDBM50003963
Synonyms:
CHEMBL1094988
Type:
Small organic molecule
Emp. Form.:
C19H21NO5
Mol. Mass.:
343.3737
SMILES:
COc1cccc(\C=C\C(=O)Nc2cc(OC)c(OC)c(OC)c2)c1
: