Target
Dipeptidyl peptidase 4
Ligand
BDBM50003970
Substrate
Meas. Tech.
ChEMBL_1337358 (CHEMBL3241352)
IC50
217±n/a nM
Citation
 Jadav, PBahekar, RShah, SRPatel, DJoharapurkar, AJain, MSairam, KVSingh, PK Design, synthesis and biological evaluation of novel aminomethyl-piperidones based DPP-IV inhibitors. Bioorg Med Chem Lett 24:1918-22 (2014)  
Target
Name:
Dipeptidyl peptidase 4
Synonyms:
ADABP Adenosine deaminase complexing protein 2 CD_antigen=CD26 DPP4 DPPIV Dipeptidyl peptidase 4 (DPP IV) Dipeptidyl peptidase 4 (DPP4) Dipeptidyl peptidase 4 membrane form Dipeptidyl peptidase IV Dipeptidyl peptidase IV (DDP-IV) Dipeptidyl peptidase IV membrane form Dipeptidyl peptidase-IV (DPP-4) T-cell activation antigen CD26 | TP103
Type:
Enzyme
Mol. Mass.:
88271.01
Organism:
Homo sapiens (Human)
Description:
P27487
Residue:
766
  
Inhibitor
Name:
BDBM50003970
Synonyms:
CHEMBL3236104
Type:
Small organic molecule
Emp. Form.:
C19H20F2N2O2
Mol. Mass.:
346.3711
SMILES:
COc1ccc(cc1)N1C[C@H](CN)[C@H](CC1=O)c1cc(F)ccc1F
: