Target
Dipeptidyl peptidase 4
Ligand
BDBM50004101
Substrate
Meas. Tech.
ChEMBL_1337358 (CHEMBL3241352)
IC50
125±n/a nM
Citation
 Jadav, PBahekar, RShah, SRPatel, DJoharapurkar, AJain, MSairam, KVSingh, PK Design, synthesis and biological evaluation of novel aminomethyl-piperidones based DPP-IV inhibitors. Bioorg Med Chem Lett 24:1918-22 (2014)  
Target
Name:
Dipeptidyl peptidase 4
Synonyms:
ADABP Adenosine deaminase complexing protein 2 CD_antigen=CD26 DPP4 DPPIV Dipeptidyl peptidase 4 (DPP IV) Dipeptidyl peptidase 4 (DPP4) Dipeptidyl peptidase 4 membrane form Dipeptidyl peptidase IV Dipeptidyl peptidase IV (DDP-IV) Dipeptidyl peptidase IV membrane form Dipeptidyl peptidase-IV (DPP-4) T-cell activation antigen CD26 | TP103
Type:
Enzyme
Mol. Mass.:
88271.01
Organism:
Homo sapiens (Human)
Description:
P27487
Residue:
766
  
Inhibitor
Name:
BDBM50004101
Synonyms:
CHEMBL3236124
Type:
Small organic molecule
Emp. Form.:
C18H14F6N6O
Mol. Mass.:
444.3338
SMILES:
NC[C@H]1CN(C(=O)C[C@@H]1c1cc(F)c(F)cc1F)c1ccc2nnc(n2n1)C(F)(F)F
: