Target
Nociceptin receptor
Ligand
BDBM50004196
Substrate
Meas. Tech.
ChEMBL_1339020 (CHEMBL3243886)
Ki
0.093900±n/a nM
Citation
 Toledo, MAPedregal, CLafuente, CDiaz, NMartinez-Grau, MAJiménez, ABenito, ATorrado, AMateos, CJoshi, EMKahl, SDRash, KSMudra, DRBarth, VNShaw, DBMcKinzie, DWitkin, JMStatnick, MA Discovery of a novel series of orally active nociceptin/orphanin FQ (NOP) receptor antagonists based on a dihydrospiro(piperidine-4,7'-thieno[2,3-c]pyran) scaffold. J Med Chem 57:3418-29 (2014)  
Target
Name:
Nociceptin receptor
Synonyms:
KOR-3 Mu-type opioid receptor (Mu) Nociceptin Receptor (ORL1 Receptor) Nociceptin receptor (ORL-1) Nociceptin/Orphanin FQ, NOP receptor OPIATE ORL-1 OPRL1 protein ORL1 Opioid receptor like-1 Orphanin FQ receptor (ORL1) | P41146
Type:
G Protein-Coupled Receptor (GPCR)
Mol. Mass.:
40702.87
Organism:
Homo sapiens (Human)
Description:
P41146
Residue:
370
  
Inhibitor
Name:
BDBM50004196
Synonyms:
CHEMBL3236479
Type:
Small organic molecule
Emp. Form.:
C27H33FN4O8S
Mol. Mass.:
592.636
SMILES:
OC(C(O)C(O)=O)C(O)=O.COCc1cccnc1-n1cc(CN2CCC3(CC2)OCCc2cc(F)sc32)c(C)n1
: