Target
Polyunsaturated fatty acid 5-lipoxygenase
Ligand
BDBM50004424
Substrate
Meas. Tech.
ChEMBL_1336618 (CHEMBL3240356)
IC50
4.0±n/a nM
Citation
 Shang, ELiu, YWu, YZhu, WHe, CLai, L Development of 3,5-dinitrobenzoate-based 5-lipoxygenase inhibitors. Bioorg Med Chem 22:2396-402 (2014)  
Target
Name:
Polyunsaturated fatty acid 5-lipoxygenase
Synonyms:
5-LO 5-Lipoxygenase (5-LO) 5-Lipoygenase ALOX5 LOG5 | LOX5_HUMAN
Type:
Enzyme
Mol. Mass.:
77972.74
Organism:
Homo sapiens (Human)
Description:
Recombinant protein was purified from E. coli lysate. After ammonium sulfate precipitation and subsequent steps, the supernatant (S100) was used for 5-LO activity assay.
Residue:
674
  
Inhibitor
Name:
BDBM50004424
Synonyms:
CHEMBL3238463
Type:
Small organic molecule
Emp. Form.:
C17H11N3O5
Mol. Mass.:
337.2863
SMILES:
[O-][N+](=O)c1cc(cc(c1)[N+]([O-])=O)C(=O)Nc1cccc2ccccc12
: