Target
Nuclear receptor ROR-gamma
Ligand
BDBM50005413
Substrate
Meas. Tech.
ChEMBL_1338694 (CHEMBL3242032)
IC50
1210±n/a nM
Citation
 Zhang, YXue, XJin, XSong, YLi, JLuo, XSong, MYan, WSong, HXu, Y Discovery of 2-oxo-1,2-dihydrobenzo[cd]indole-6-sulfonamide derivatives as new ROR¿ inhibitors using virtual screening, synthesis and biological evaluation. Eur J Med Chem 78:431-41 (2014)  
Target
Name:
Nuclear receptor ROR-gamma
Synonyms:
NR1F3 Nuclear receptor ROR-gamma (RORC) RAR-related orphan receptor C (RORc) RORG RZRG Retinoid-related orphan receptor-gamma (RORc)
Type:
Enzyme Catalytic Domain
Mol. Mass.:
58218.40
Organism:
Homo sapiens (Human)
Description:
P51449
Residue:
518
  
Inhibitor
Name:
BDBM50005413
Synonyms:
CHEMBL138148 | CHEMBL3234027
Type:
Small organic molecule
Emp. Form.:
C22H18FN3O3S
Mol. Mass.:
423.46
SMILES:
CCN1C(=O)c2cccc3c(ccc1c23)S(=O)(=O)NCc1cc2cc(F)ccc2[nH]1
: