Target
Nuclear receptor ROR-gamma
Ligand
BDBM50005473
Substrate
Meas. Tech.
ChEMBL_1338695 (CHEMBL3242033)
IC50
410±n/a nM
Citation
 Zhang, YXue, XJin, XSong, YLi, JLuo, XSong, MYan, WSong, HXu, Y Discovery of 2-oxo-1,2-dihydrobenzo[cd]indole-6-sulfonamide derivatives as new ROR¿ inhibitors using virtual screening, synthesis and biological evaluation. Eur J Med Chem 78:431-41 (2014)  
Target
Name:
Nuclear receptor ROR-gamma
Synonyms:
NR1F3 Nuclear receptor ROR-gamma (RORC) RAR-related orphan receptor C (RORc) RORG RZRG Retinoid-related orphan receptor-gamma (RORc)
Type:
Enzyme Catalytic Domain
Mol. Mass.:
58218.40
Organism:
Homo sapiens (Human)
Description:
P51449
Residue:
518
  
Inhibitor
Name:
BDBM50005473
Synonyms:
CHEMBL3234240 | CHEMBL345036
Type:
Small organic molecule
Emp. Form.:
C21H19N3O4S
Mol. Mass.:
409.458
SMILES:
O=C1Nc2ccc(c3cccc1c23)S(=O)(=O)Nc1ccc(cc1)N1CCOCC1
: