Target
Nuclear receptor ROR-gamma
Ligand
BDBM50005487
Substrate
Meas. Tech.
ChEMBL_1338695 (CHEMBL3242033)
IC50
20±n/a nM
Citation
 Zhang, YXue, XJin, XSong, YLi, JLuo, XSong, MYan, WSong, HXu, Y Discovery of 2-oxo-1,2-dihydrobenzo[cd]indole-6-sulfonamide derivatives as new ROR¿ inhibitors using virtual screening, synthesis and biological evaluation. Eur J Med Chem 78:431-41 (2014)  
Target
Name:
Nuclear receptor ROR-gamma
Synonyms:
NR1F3 Nuclear receptor ROR-gamma (RORC) RAR-related orphan receptor C (RORc) RORG RZRG Retinoid-related orphan receptor-gamma (RORc)
Type:
Enzyme Catalytic Domain
Mol. Mass.:
58218.40
Organism:
Homo sapiens (Human)
Description:
P51449
Residue:
518
  
Inhibitor
Name:
BDBM50005487
Synonyms:
CHEMBL3234259 | CHEMBL342856
Type:
Small organic molecule
Emp. Form.:
C21H20N2O5S
Mol. Mass.:
412.459
SMILES:
CCN1C(=O)c2cccc3c(ccc1c23)S(=O)(=O)Nc1ccc(OC)c(OC)c1
: