Target
Nuclear receptor ROR-gamma
Ligand
BDBM50005488
Substrate
Meas. Tech.
ChEMBL_1338695 (CHEMBL3242033)
IC50
80±n/a nM
Citation
 Zhang, YXue, XJin, XSong, YLi, JLuo, XSong, MYan, WSong, HXu, Y Discovery of 2-oxo-1,2-dihydrobenzo[cd]indole-6-sulfonamide derivatives as new ROR¿ inhibitors using virtual screening, synthesis and biological evaluation. Eur J Med Chem 78:431-41 (2014)  
Target
Name:
Nuclear receptor ROR-gamma
Synonyms:
NR1F3 Nuclear receptor ROR-gamma (RORC) RAR-related orphan receptor C (RORc) RORG RZRG Retinoid-related orphan receptor-gamma (RORc)
Type:
Enzyme Catalytic Domain
Mol. Mass.:
58218.40
Organism:
Homo sapiens (Human)
Description:
P51449
Residue:
518
  
Inhibitor
Name:
BDBM50005488
Synonyms:
CHEMBL139135 | CHEMBL1494527
Type:
Small organic molecule
Emp. Form.:
C26H21N3O5S
Mol. Mass.:
487.527
SMILES:
CCN1C(=O)c2cccc3c(ccc1c23)S(=O)(=O)N(C(=O)c1ccncc1)c1ccc(OC)cc1
: