Target
Cannabinoid receptor 2
Ligand
BDBM50006258
Substrate
Meas. Tech.
ChEMBL_1334788 (CHEMBL3238895)
EC50
0.040000±n/a nM
Citation
 Han, SThatte, JBuzard, DJJones, RM Therapeutic utility of cannabinoid receptor type 2 (CB(2)) selective agonists. Cell Chem Biol 56:8224-56 (2013)  
Target
Name:
Cannabinoid receptor 2
Synonyms:
CANNABINOID CB2 CB2 CB2B CNR2_HUMAN Cannabinoid CB2 receptor Cannabinoid receptor 2 (CB2R) | hCB2
Type:
G Protein-Coupled Receptor (GPCR)
Mol. Mass.:
39690.94
Organism:
Homo sapiens (Human)
Description:
P34972
Residue:
360
  
Inhibitor
Name:
BDBM50006258
Synonyms:
CHEMBL3234701
Type:
Small organic molecule
Emp. Form.:
C16H28N2O4S
Mol. Mass.:
344.47
SMILES:
CC(C)CCS(=O)(=O)C(C)(C)C(=O)Nc1cc(no1)C(C)(C)C
: