Target
Cannabinoid receptor 2
Ligand
BDBM50272598
Substrate
Meas. Tech.
ChEMBL_1334657 (CHEMBL3239857)
Ki
1.000000±n/a nM
Citation
 Han, SThatte, JBuzard, DJJones, RM Therapeutic utility of cannabinoid receptor type 2 (CB(2)) selective agonists. Cell Chem Biol 56:8224-56 (2013)  
Target
Name:
Cannabinoid receptor 2
Synonyms:
CANNABINOID CB2 CB2 CB2B CNR2_HUMAN Cannabinoid CB2 receptor Cannabinoid receptor 2 (CB2R) | hCB2
Type:
G Protein-Coupled Receptor (GPCR)
Mol. Mass.:
39690.94
Organism:
Homo sapiens (Human)
Description:
P34972
Residue:
360
  
Inhibitor
Name:
BDBM50272598
Synonyms:
6-Methoxy-5-(2-morpholin-4-yl-ethyl)-2-(1,3,3-trimethyl-bicyclo[2.2.1]hept-2-yl)-2,5-dihydro-pyrido[4,3-b]indol-1-one CHEMBL527031
Type:
Small organic molecule
Emp. Form.:
C28H37N3O3
Mol. Mass.:
463.6117
SMILES:
COc1cccc2c1n(CCN1CCOCC1)c1ccn([C@H]3[C@@]4(C)CC[C@H](C4)C3(C)C)c(=O)c21
: