Target
Cytochrome P450 3A4
Ligand
BDBM50006830
Substrate
Meas. Tech.
ChEMBL_1337037 (CHEMBL3242640)
IC50
>100000±n/a nM
Citation
 Kaila, NFollows, BLeung, LThomason, JHuang, AMoretto, AJanz, KLowe, MMansour, TSHubeau, CPage, KMorgan, PFish, SXu, XWilliams, CSaiah, E Discovery of isoquinolinone indole acetic acids as antagonists of chemoattractant receptor homologous molecule expressed on Th2 cells (CRTH2) for the treatment of allergic inflammatory diseases. J Med Chem 57:1299-322 (2014)  
Target
Name:
Cytochrome P450 3A4
Synonyms:
Albendazole monooxygenase CP3A4_HUMAN CYP3A4 CYPIIIA4 Cytochrome P450 3A4 (CYP3A4) Nifedipine oxidase Taurochenodeoxycholate 6-alpha-hydroxylase
Type:
Enzyme
Mol. Mass.:
57349.57
Organism:
Homo sapiens (Human)
Description:
Residue:
503
  
Inhibitor
Name:
BDBM50006830
Synonyms:
CHEMBL3236948
Type:
Small organic molecule
Emp. Form.:
C23H21FN2O3
Mol. Mass.:
392.4228
SMILES:
CC(C)n1cc(-c2c(C)n(CC(O)=O)c3ccc(F)cc23)c2ccccc2c1=O
: