Target
5-hydroxytryptamine receptor 1A
Ligand
BDBM50010524
Substrate
Meas. Tech.
ChEMBL_1353507 (CHEMBL3269843)
Ki
21±n/a nM
Citation
 Liégeois, JFLespagnard, MMeneses Salas, EMangin, FScuvée-Moreau, JDilly, S Enhancing a CH-? Interaction to Increase the Affinity for 5-HT1A Receptors. ACS Med Chem Lett 5:358-62 (2014)  
Target
Name:
5-hydroxytryptamine receptor 1A
Synonyms:
5-HT-1A 5-hydroxytryptamine receptor 1A (5-HT-1A) ADRB2RL1 Dopamine D2 receptor and serotonin 1a receptor HTR1A | Serotonin receptor 1A
Type:
Mol. Mass.:
46122.49
Organism:
Homo sapiens (Human)
Description:
Residue:
422
  
Inhibitor
Name:
BDBM50010524
Synonyms:
CHEMBL3264385
Type:
Small organic molecule
Emp. Form.:
C25H29N3O
Mol. Mass.:
387.5173
SMILES:
Cc1cc(C)cc(c1)N1CCN(CCNC(=O)c2ccc3ccccc3c2)CC1
: