Target
Nuclear receptor ROR-beta
Ligand
BDBM50012123
Substrate
Meas. Tech.
ChEMBL_1351787 (CHEMBL3270938)
EC50
2200±n/a nM
Citation
 Fauber, BPRené, OBurton, BEverett, CGobbi, AHawkins, JJohnson, ARLiimatta, MLockey, PNorman, MWong, H Identification of tertiary sulfonamides as RORc inverse agonists. Bioorg Med Chem Lett 24:2182-7 (2014)  
Target
Name:
Nuclear receptor ROR-beta
Synonyms:
NR1F2 Nuclear receptor subfamily 1 group F member 2 RORB_HUMAN Retinoid-related orphan receptor-beta
Type:
PROTEIN
Mol. Mass.:
53227.30
Organism:
Homo sapiens (Human)
Description:
ChEMBL_107979
Residue:
470
  
Inhibitor
Name:
BDBM50012123
Synonyms:
CHEMBL3263696
Type:
Small organic molecule
Emp. Form.:
C23H27NO4S3
Mol. Mass.:
477.66
SMILES:
CC(C)CN(Cc1ccc(s1)-c1ccc(cc1)S(C)(=O)=O)S(=O)(=O)Cc1ccccc1
: