Target
Oxysterols receptor LXR-beta
Ligand
BDBM50012122
Substrate
Meas. Tech.
ChEMBL_1351790 (CHEMBL3270941)
EC50
1900±n/a nM
Citation
 Fauber, BPRené, OBurton, BEverett, CGobbi, AHawkins, JJohnson, ARLiimatta, MLockey, PNorman, MWong, H Identification of tertiary sulfonamides as RORc inverse agonists. Bioorg Med Chem Lett 24:2182-7 (2014)  
Target
Name:
Oxysterols receptor LXR-beta
Synonyms:
LXRB Liver X, LXR beta NR1H2 Nuclear receptor NER Ubiquitously-expressed nuclear receptor
Type:
Enzyme Catalytic Domain
Mol. Mass.:
50978.79
Organism:
Homo sapiens (Human)
Description:
P55055
Residue:
460
  
Inhibitor
Name:
BDBM50012122
Synonyms:
CHEMBL3263695
Type:
Small organic molecule
Emp. Form.:
C23H27NO4S3
Mol. Mass.:
477.66
SMILES:
CC(C)CN(Cc1ccc(s1)-c1cccc(c1)S(C)(=O)=O)S(=O)(=O)Cc1ccccc1
: