Target
Oxysterols receptor LXR-beta
Ligand
BDBM50012130
Substrate
Meas. Tech.
ChEMBL_1351790 (CHEMBL3270941)
EC50
2500±n/a nM
Citation
 Fauber, BPRené, OBurton, BEverett, CGobbi, AHawkins, JJohnson, ARLiimatta, MLockey, PNorman, MWong, H Identification of tertiary sulfonamides as RORc inverse agonists. Bioorg Med Chem Lett 24:2182-7 (2014)  
Target
Name:
Oxysterols receptor LXR-beta
Synonyms:
LXRB Liver X, LXR beta NR1H2 Nuclear receptor NER Ubiquitously-expressed nuclear receptor
Type:
Enzyme Catalytic Domain
Mol. Mass.:
50978.79
Organism:
Homo sapiens (Human)
Description:
P55055
Residue:
460
  
Inhibitor
Name:
BDBM50012130
Synonyms:
CHEMBL3263710
Type:
Small organic molecule
Emp. Form.:
C25H29NO4S2
Mol. Mass.:
471.632
SMILES:
CC(C)CN(Cc1ccc(cc1)-c1ccc(cc1)S(C)(=O)=O)S(=O)(=O)Cc1ccccc1
: