Target
Nuclear receptor ROR-gamma
Ligand
BDBM50012140
Substrate
Meas. Tech.
ChEMBL_1351781 (CHEMBL3270932)
IC50
>10000±n/a nM
Citation
 Fauber, BPRené, OBurton, BEverett, CGobbi, AHawkins, JJohnson, ARLiimatta, MLockey, PNorman, MWong, H Identification of tertiary sulfonamides as RORc inverse agonists. Bioorg Med Chem Lett 24:2182-7 (2014)  
Target
Name:
Nuclear receptor ROR-gamma
Synonyms:
NR1F3 Nuclear receptor ROR-gamma (RORC) RAR-related orphan receptor C (RORc) RORG RZRG Retinoid-related orphan receptor-gamma (RORc)
Type:
Enzyme Catalytic Domain
Mol. Mass.:
58218.40
Organism:
Homo sapiens (Human)
Description:
P51449
Residue:
518
  
Inhibitor
Name:
BDBM50012140
Synonyms:
CHEMBL3263708
Type:
Small organic molecule
Emp. Form.:
C22H26N2O4S3
Mol. Mass.:
478.648
SMILES:
CC(C)CN(Cc1cnc(s1)-c1ccc(cc1)S(C)(=O)=O)S(=O)(=O)Cc1ccccc1
: