Target
Nuclear receptor ROR-gamma
Ligand
BDBM50012258
Substrate
Meas. Tech.
ChEMBL_1351232 (CHEMBL3271687)
IC50
9300±n/a nM
Citation
 Nishiyama, YNakamura, MMisawa, TNakagomi, MMakishima, MIshikawa, MHashimoto, Y Structure-activity relationship-guided development of retinoic acid receptor-related orphan receptor gamma (ROR¿)-selective inverse agonists with a phenanthridin-6(5H)-one skeleton from a liver X receptor ligand. Bioorg Med Chem 22:2799-808 (2014)  
Target
Name:
Nuclear receptor ROR-gamma
Synonyms:
NR1F3 Nuclear receptor ROR-gamma (RORC) RAR-related orphan receptor C (RORc) RORG RZRG Retinoid-related orphan receptor-gamma (RORc)
Type:
Enzyme Catalytic Domain
Mol. Mass.:
58218.40
Organism:
Homo sapiens (Human)
Description:
P51449
Residue:
518
  
Inhibitor
Name:
BDBM50012258
Synonyms:
CHEMBL3259993
Type:
Small organic molecule
Emp. Form.:
C20H15F6NO2
Mol. Mass.:
415.329
SMILES:
OC(c1ccc2n(CC3CC3)c(=O)c3ccccc3c2c1)(C(F)(F)F)C(F)(F)F
: