Target
Nuclear receptor ROR-beta
Ligand
BDBM50012206
Substrate
Meas. Tech.
ChEMBL_1351231 (CHEMBL3271686)
IC50
10100±n/a nM
Citation
 Nishiyama, YNakamura, MMisawa, TNakagomi, MMakishima, MIshikawa, MHashimoto, Y Structure-activity relationship-guided development of retinoic acid receptor-related orphan receptor gamma (ROR¿)-selective inverse agonists with a phenanthridin-6(5H)-one skeleton from a liver X receptor ligand. Bioorg Med Chem 22:2799-808 (2014)  
Target
Name:
Nuclear receptor ROR-beta
Synonyms:
NR1F2 Nuclear receptor subfamily 1 group F member 2 RORB_HUMAN Retinoid-related orphan receptor-beta
Type:
PROTEIN
Mol. Mass.:
53227.30
Organism:
Homo sapiens (Human)
Description:
ChEMBL_107979
Residue:
470
  
Inhibitor
Name:
BDBM50012206
Synonyms:
CHEMBL1093518
Type:
Small organic molecule
Emp. Form.:
C18H10F9NO2
Mol. Mass.:
443.2631
SMILES:
OC(c1ccc2n(CC(F)(F)F)c(=O)c3ccccc3c2c1)(C(F)(F)F)C(F)(F)F
: