Target
Nuclear receptor ROR-beta
Ligand
BDBM50012275
Substrate
Meas. Tech.
ChEMBL_1351231 (CHEMBL3271686)
IC50
4900±n/a nM
Citation
 Nishiyama, YNakamura, MMisawa, TNakagomi, MMakishima, MIshikawa, MHashimoto, Y Structure-activity relationship-guided development of retinoic acid receptor-related orphan receptor gamma (ROR¿)-selective inverse agonists with a phenanthridin-6(5H)-one skeleton from a liver X receptor ligand. Bioorg Med Chem 22:2799-808 (2014)  
Target
Name:
Nuclear receptor ROR-beta
Synonyms:
NR1F2 Nuclear receptor subfamily 1 group F member 2 RORB_HUMAN Retinoid-related orphan receptor-beta
Type:
PROTEIN
Mol. Mass.:
53227.30
Organism:
Homo sapiens (Human)
Description:
ChEMBL_107979
Residue:
470
  
Inhibitor
Name:
BDBM50012275
Synonyms:
CHEMBL3260000
Type:
Small organic molecule
Emp. Form.:
C20H16ClF6NO2
Mol. Mass.:
451.79
SMILES:
CCCCn1c2ccc(cc2c2cc(Cl)ccc2c1=O)C(O)(C(F)(F)F)C(F)(F)F
: