Target
Orexin receptor type 2
Ligand
BDBM50012608
Substrate
Meas. Tech.
ChEMBL_1351466 (CHEMBL3267682)
Ki
0.200000±n/a nM
Citation
 Roecker, AJMercer, SPHarrell, CMGarson, SLFox, SVGotter, ALPrueksaritanont, TCabalu, TDCui, DLemaire, WWinrow, CJRenger, JJColeman, PJ Discovery of dual orexin receptor antagonists with rat sleep efficacy enabled by expansion of the acetonitrile-assisted/diphosgene-mediated 2,4-dichloropyrimidine synthesis. Bioorg Med Chem Lett 24:2079-85 (2014)  
Target
Name:
Orexin receptor type 2
Synonyms:
HCRTR2 OX2R_HUMAN Orexin receptor type 2 (OR-2) Orexin receptor type 2 (OX2R) Ox-2-R | Ox2-R
Type:
Protein
Mol. Mass.:
50710.53
Organism:
Homo sapiens (Human)
Description:
O43614
Residue:
444
  
Inhibitor
Name:
BDBM50012608
Synonyms:
CHEMBL3260828
Type:
Small organic molecule
Emp. Form.:
C23H25N7OS
Mol. Mass.:
447.556
SMILES:
C[C@@H]1CCN(CCN1C(=O)c1cc(C)ccc1-n1nccn1)c1ncc2c(C)csc2n1
: