Target
Prostaglandin G/H synthase 1
Ligand
BDBM50015582
Substrate
Meas. Tech.
ChEMBL_1348630 (CHEMBL3268341)
IC50
>100000±n/a nM
Citation
 Bansal, SBala, MSuthar, SKChoudhary, SBhattacharya, SBhardwaj, VSingla, SJoseph, A Design and synthesis of novel 2-phenyl-5-(1,3-diphenyl-1H-pyrazol-4-yl)-1,3,4-oxadiazoles as selective COX-2 inhibitors with potent anti-inflammatory activity. Eur J Med Chem 80:167-74 (2014)  
Target
Name:
Prostaglandin G/H synthase 1
Synonyms:
COX1 Cyclooxygenase-1 (COX-1) PTGS1 | Prostaglandin G/H synthase (cyclooxygenase)
Type:
Protein
Mol. Mass.:
68868.60
Organism:
Ovis aries (Sheep)
Description:
Residue:
600
  
Inhibitor
Name:
BDBM50015582
Synonyms:
CHEMBL1242365
Type:
Small organic molecule
Emp. Form.:
C23H15BrN4O
Mol. Mass.:
443.295
SMILES:
Brc1ccc(cc1)-c1nn(cc1-c1nnc(o1)-c1ccccc1)-c1ccccc1
: