Target
Prostaglandin E2 receptor EP3 subtype
Ligand
BDBM85184
Substrate
Meas. Tech.
ChEMBL_1364728 (CHEMBL3293989)
Ki
1600±n/a nM
Citation
 Ganesh, T Prostanoid receptor EP2 as a therapeutic target. J Med Chem 57:4454-65 (2014)  
Target
Name:
Prostaglandin E2 receptor EP3 subtype
Synonyms:
PE2R3_HUMAN PGE2-R Prostaglandin E2 receptor Prostaglandin E2 receptor EP3 subtype (EP3) Prostaglandin E2 receptor EP3D subtype (EP3D) | Prostanoid EP3 receptor
Type:
Enzyme
Mol. Mass.:
43335.03
Organism:
Homo sapiens (Human)
Description:
P43115
Residue:
390
  
Inhibitor
Name:
BDBM85184
Synonyms:
AH-6809 NSC_119461
Type:
Small organic molecule
Emp. Form.:
C17H14O5
Mol. Mass.:
298.2901
SMILES:
CC(C)Oc1ccc2c(c1)oc1ccc(cc1c2=O)C(O)=O
: