Target
Prostacyclin receptor
Ligand
BDBM85184
Substrate
Meas. Tech.
ChEMBL_1364731 (CHEMBL3293992)
Ki
>100000±n/a nM
Citation
 Ganesh, T Prostanoid receptor EP2 as a therapeutic target. J Med Chem 57:4454-65 (2014)  
Target
Name:
Prostacyclin receptor
Synonyms:
PGI receptor PRIPR Prostacyclin (IP) Receptor Prostaglandin I Prostaglandin I2 receptor | Prostanoid IP receptor
Type:
G Protein-Coupled Receptor (GPCR)
Mol. Mass.:
40968.22
Organism:
Homo sapiens (Human)
Description:
The membranes prepared from human platelet were used in binding assay.
Residue:
386
  
Inhibitor
Name:
BDBM85184
Synonyms:
AH-6809 NSC_119461
Type:
Small organic molecule
Emp. Form.:
C17H14O5
Mol. Mass.:
298.2901
SMILES:
CC(C)Oc1ccc2c(c1)oc1ccc(cc1c2=O)C(O)=O
: