Target
cAMP-specific 3',5'-cyclic phosphodiesterase 4B
Ligand
BDBM50017307
Substrate
Meas. Tech.
ChEMBL_1362418 (CHEMBL3292526)
IC50
0.019953±n/a nM
Citation
 De Savi, CCox, RJWarner, DJCook, ARDickinson, MRMcDonough, AMorrill, LCParker, BAndrews, GYoung, SSGilmour, PSRiley, RDearman, MS Efficacious inhaled PDE4 inhibitors with low emetic potential and long duration of action for the treatment of COPD. J Med Chem 57:4661-76 (2014)  
Target
Name:
cAMP-specific 3',5'-cyclic phosphodiesterase 4B
Synonyms:
3',5'-cyclic phosphodiesterase Isoform PDE4B1 PDE4B PDE4B_HUMAN Phosphodiesterase 4B (PDE4B) Phosphodiesterase Type 4 (PDE4B)
Type:
Protein
Mol. Mass.:
83318.87
Organism:
Homo sapiens (Human)
Description:
Q07343
Residue:
736
  
Inhibitor
Name:
BDBM50017307
Synonyms:
CHEMBL3287994
Type:
Small organic molecule
Emp. Form.:
C37H40FN5O5
Mol. Mass.:
653.7424
SMILES:
Cc1cccc(n1)C(=O)N[C@H]1CC[C@H](CC1)NC(=O)c1cc(F)cnc1Oc1cccc(c1)-c1ccc(O)cc1CN1CCCOCC1
: