Target
cAMP-specific 3',5'-cyclic phosphodiesterase 4B
Ligand
BDBM50017312
Substrate
Meas. Tech.
ChEMBL_1362418 (CHEMBL3292526)
IC50
0.050119±n/a nM
Citation
 De Savi, CCox, RJWarner, DJCook, ARDickinson, MRMcDonough, AMorrill, LCParker, BAndrews, GYoung, SSGilmour, PSRiley, RDearman, MS Efficacious inhaled PDE4 inhibitors with low emetic potential and long duration of action for the treatment of COPD. J Med Chem 57:4661-76 (2014)  
Target
Name:
cAMP-specific 3',5'-cyclic phosphodiesterase 4B
Synonyms:
3',5'-cyclic phosphodiesterase Isoform PDE4B1 PDE4B PDE4B_HUMAN Phosphodiesterase 4B (PDE4B) Phosphodiesterase Type 4 (PDE4B)
Type:
Protein
Mol. Mass.:
83318.87
Organism:
Homo sapiens (Human)
Description:
Q07343
Residue:
736
  
Inhibitor
Name:
BDBM50017312
Synonyms:
CHEMBL3287998
Type:
Small organic molecule
Emp. Form.:
C35H34F2N6O4
Mol. Mass.:
640.6791
SMILES:
CN(C)Cc1cc(O)ccc1-c1cccc(Oc2ncc(F)cc2C(=O)N[C@@H]2CC[C@@H](CC2)NC(=O)c2cn3cc(F)ccc3n2)c1
: