Target
cAMP-specific 3',5'-cyclic phosphodiesterase 4B
Ligand
BDBM50017336
Substrate
Meas. Tech.
ChEMBL_1362418 (CHEMBL3292526)
IC50
0.031623±n/a nM
Citation
 De Savi, CCox, RJWarner, DJCook, ARDickinson, MRMcDonough, AMorrill, LCParker, BAndrews, GYoung, SSGilmour, PSRiley, RDearman, MS Efficacious inhaled PDE4 inhibitors with low emetic potential and long duration of action for the treatment of COPD. J Med Chem 57:4661-76 (2014)  
Target
Name:
cAMP-specific 3',5'-cyclic phosphodiesterase 4B
Synonyms:
3',5'-cyclic phosphodiesterase Isoform PDE4B1 PDE4B PDE4B_HUMAN Phosphodiesterase 4B (PDE4B) Phosphodiesterase Type 4 (PDE4B)
Type:
Protein
Mol. Mass.:
83318.87
Organism:
Homo sapiens (Human)
Description:
Q07343
Residue:
736
  
Inhibitor
Name:
BDBM50017336
Synonyms:
CHEMBL3288025
Type:
Small organic molecule
Emp. Form.:
C37H44FN7O4
Mol. Mass.:
669.7882
SMILES:
C[C@H]1CN(Cc2cc(O)cc(c2)-c2cccc(Oc3ncc(F)cc3C(=O)N[C@@H]3CC[C@@H](CC3)NC(=O)c3cc(C)n(C)n3)c2)C[C@@H](C)N1
: