Target
D(3) dopamine receptor
Ligand
BDBM50362853
Substrate
Meas. Tech.
ChEMBL_1365237 (CHEMBL3292987)
Ki
261±n/a nM
Citation
 Sampson, DZhu, XYEyunni, SVEtukala, JROfori, EBricker, BLamango, NSSetola, VRoth, BLAblordeppey, SY Identification of a new selective dopamine D4 receptor ligand. Bioorg Med Chem 22:3105-14 (2014)  
Target
Name:
D(3) dopamine receptor
Synonyms:
DOPAMINE D3 DRD3_HUMAN Dopamine D3 receptor (D3) Dopamine receptor Dopamine receptor D3
Type:
Mol. Mass.:
44243.43
Organism:
Homo sapiens (Human)
Description:
Residue:
400
  
Inhibitor
Name:
BDBM50362853
Synonyms:
CHEMBL1940408
Type:
Small organic molecule
Emp. Form.:
C20H24ClFN2
Mol. Mass.:
346.869
SMILES:
Fc1ccc(CCCCN2CCN(CC2)c2ccc(Cl)cc2)cc1
: