Target
Muscarinic acetylcholine receptor M3
Ligand
BDBM50176065
Substrate
Meas. Tech.
ChEMBL_1361018 (CHEMBL3295396)
Ki
0.440000±n/a nM
Citation
 Kolaczkowski, MMarcinkowska, MBucki, APawlowski, MMitka, KJaskowska, JKowalski, PKazek, GSiwek, AWasik, AWesolowska, AMierzejewski, PBienkowski, P Novel arylsulfonamide derivatives with 5-HT6/5-HT7 receptor antagonism targeting behavioral and psychological symptoms of dementia. J Med Chem 57:4543-57 (2014)  
Target
Name:
Muscarinic acetylcholine receptor M3
Synonyms:
ACM3_HUMAN Cholinergic, muscarinic M3 Muscarinic receptor M3 | RecName: Full=Muscarinic acetylcholine receptor M3
Type:
Enzyme
Mol. Mass.:
66151.03
Organism:
Homo sapiens (Human)
Description:
P20309
Residue:
590
  
Inhibitor
Name:
BDBM50176065
Synonyms:
4-DAMP Acetic acid 4-[(4-acetoxy-phenyl)-pyridin-2-yl-methyl]-phenyl ester CHEMBL76897
Type:
Small organic molecule
Emp. Form.:
C21H26NO2
Mol. Mass.:
324.4361
SMILES:
C[N+]1(C)CCC(CC1)OC(=O)C(c1ccccc1)c1ccccc1
: