Target
cAMP and cAMP-inhibited cGMP 3',5'-cyclic phosphodiesterase 10A
Ligand
BDBM50019119
Substrate
Meas. Tech.
ChEMBL_1361474 (CHEMBL3294350)
IC50
9.2±n/a nM
Citation
 Chino, AMasuda, NAmano, YHonbou, KMihara, TYamazaki, MTomishima, M Novel benzimidazole derivatives as phosphodiesterase 10A (PDE10A) inhibitors with improved metabolic stability. Bioorg Med Chem 22:3515-26 (2014)  
Target
Name:
cAMP and cAMP-inhibited cGMP 3',5'-cyclic phosphodiesterase 10A
Synonyms:
3',5'-cyclic phosphodiesterase PDE10_HUMAN Phosphodiesterase 10A
Type:
Protein
Mol. Mass.:
88412.52
Organism:
Homo sapiens (Human)
Description:
Q9Y233
Residue:
779
  
Inhibitor
Name:
BDBM50019119
Synonyms:
CHEMBL3288414
Type:
Small organic molecule
Emp. Form.:
C23H21N5O
Mol. Mass.:
383.4457
SMILES:
Cc1ccc2n(c(CCn3c4ncccc4n(C)c3=O)nc2c1)-c1ccccc1
: