Target
Muscarinic acetylcholine receptor M1
Ligand
BDBM50021901
Substrate
Meas. Tech.
ChEMBL_1367094
Ki
0.510000±n/a nM
Citation
 Nagashima, SMatsushima, YHamaguchi, HNagata, HKontani, TMoritomo, AKoshika, TTakeuchi, M Novel quinuclidinyl heteroarylcarbamate derivatives as muscarinic receptor antagonists. Bioorg Med Chem 22:3478-87 (2014)  
Target
Name:
Muscarinic acetylcholine receptor M1
Synonyms:
ACM1_RAT Chrm-1 cholinergic receptor, muscarinic 1
Type:
Enzyme Catalytic Domain
Mol. Mass.:
51390.46
Organism:
RAT
Description:
P08482
Residue:
460
  
Inhibitor
Name:
BDBM50021901
Synonyms:
CHEMBL3298334
Type:
Small organic molecule
Emp. Form.:
C18H21ClN2O2S
Mol. Mass.:
364.89
SMILES:
Cl.O=C(Nc1cscc1-c1ccccc1)OC12CCN(CC1)CC2
: