Target
Muscarinic acetylcholine receptor M2
Ligand
BDBM50021909
Substrate
Meas. Tech.
ChEMBL_1367095
Ki
0.800000±n/a nM
Citation
 Nagashima, SMatsushima, YHamaguchi, HNagata, HKontani, TMoritomo, AKoshika, TTakeuchi, M Novel quinuclidinyl heteroarylcarbamate derivatives as muscarinic receptor antagonists. Bioorg Med Chem 22:3478-87 (2014)  
Target
Name:
Muscarinic acetylcholine receptor M2
Synonyms:
ACM2_RAT Chrm-2 | Chrm2
Type:
Enzyme Catalytic Domain
Mol. Mass.:
51555.53
Organism:
RAT
Description:
P10980
Residue:
466
  
Inhibitor
Name:
BDBM50021909
Synonyms:
CHEMBL3298591
Type:
Small organic molecule
Emp. Form.:
C17H19N3O2S
Mol. Mass.:
329.417
SMILES:
O=C(Nc1ncsc1-c1ccccc1)OC12CCN(CC1)CC2
: