Target
Alpha-1A adrenergic receptor
Ligand
BDBM50023183
Substrate
Meas. Tech.
ChEMBL_1368299 (CHEMBL3299604)
Ki
1.1±n/a nM
Citation
 Romeo, GSalerno, LPittalą, VModica, MNSiracusa, MAMateria, LBuccioni, MMarucci, GMinneman, KP High affinity ligands and potent antagonists for thea1D-adrenergic receptor. Novel 3,8-disubstituted [1]benzothieno[3,2-d]pyrimidine derivatives. Eur J Med Chem 83:419-32 (2014)  
Target
Name:
Alpha-1A adrenergic receptor
Synonyms:
ADA1A_HUMAN ADRA1C Alpha 1A-adrenoceptor Alpha adrenergic receptor 1a Alpha-adrenergic receptor 1c adrenergic Alpha1 | adrenergic Alpha1C
Type:
Cell-surface receptors
Mol. Mass.:
51511.67
Organism:
Homo sapiens (Human)
Description:
P35348
Residue:
466
  
Inhibitor
Name:
BDBM50023183
Synonyms:
CHEMBL3298745
Type:
Small organic molecule
Emp. Form.:
C30H29N5O4S
Mol. Mass.:
555.647
SMILES:
COc1ccccc1N1CCN(CCn2c(=O)[nH]c3c4cc(NC(=O)c5ccccc5)ccc4sc3c2=O)CC1
: