Target
1,25-dihydroxyvitamin D(3) 24-hydroxylase, mitochondrial
Ligand
BDBM31768
Substrate
Meas. Tech.
ChEMBL_1459633 (CHEMBL3369890)
IC50
470±n/a nM
Citation
 Ferla, SAboraia, ASBrancale, APepper, CJZhu, JOchalek, JTDeLuca, HFSimons, C Small-molecule inhibitors of 25-hydroxyvitamin D-24-hydroxylase (CYP24A1): synthesis and biological evaluation. J Med Chem 57:7702-15 (2014)  
Target
Name:
1,25-dihydroxyvitamin D(3) 24-hydroxylase, mitochondrial
Synonyms:
1,25-dihydroxyvitamin D(3) 24-hydroxylase, mitochondrial CYP24 Cytochrome P450 24A1
Type:
Protein
Mol. Mass.:
58889.66
Organism:
Homo sapiens (Human)
Description:
Q07973
Residue:
514
  
Inhibitor
Name:
BDBM31768
Synonyms:
CHEMBL295698 Nizoral | Panfungol
Type:
Small organic molecule
Emp. Form.:
C26H28Cl2N4O4
Mol. Mass.:
531.431
SMILES:
CC(=O)N1CCN(CC1)c1ccc(OC[C@@H]2CO[C@](Cn3ccnc3)(O2)c2ccc(Cl)cc2Cl)cc1
: