Target
Lipoxygenase
Ligand
BDBM50025855
Substrate
Meas. Tech.
ChEMBL_1437404 (CHEMBL3386626)
IC50
57900±n/a nM
Citation
 Pavic, KPerkovic, ICindric, MPranjic, MMartin-Kleiner, IKralj, MSchols, DHadjipavlou-Litina, DKatsori, AMZorc, B Novel semicarbazides and ureas of primaquine with bulky aryl or hydroxyalkyl substituents: synthesis, cytostatic and antioxidative activity. Eur J Med Chem 86:502-14 (2014)  
Target
Name:
Lipoxygenase
Synonyms:
Type:
PROTEIN
Mol. Mass.:
1886.07
Organism:
Glycine max
Description:
ChEMBL_103841
Residue:
18
PNSEEGLTCRGIPNSISI
  
Inhibitor
Name:
BDBM50025855
Synonyms:
CHEMBL3330910
Type:
Small organic molecule
Emp. Form.:
C29H31ClN4O2
Mol. Mass.:
503.035
SMILES:
COc1cc(NC(C)CCCNC(=O)NC(c2ccccc2)c2ccc(Cl)cc2)c2ncccc2c1
: